JDownloader Community - Appwork GmbH
 

Reply
 
Thread Tools Display Modes
  #481  
Old 12.08.2019, 16:50
thecoder2012's Avatar
thecoder2012 thecoder2012 is offline
Official 9kw.eu Support
 
Join Date: Feb 2013
Location: Internet
Posts: 893
Default

Quote:
Originally Posted by Jiaz View Post
I just uploaded first bunch of files to first post. rest will come tomorrow
Tomorrow in this year or later? (Linux/ARM6+7)
__________________
Join 9kw.eu Captcha Service now and let your JD continue downloads while you sleep.

Last edited by thecoder2012; 12.08.2019 at 16:53.
Reply With Quote
  #482  
Old 12.08.2019, 17:09
Jiaz's Avatar
Jiaz Jiaz is offline
JD Manager
 
Join Date: Mar 2009
Location: Germany
Posts: 64,713
Default

Will do it later/by tomorrow. Also going to link those new built libs from community
__________________
JD-Dev & Server-Admin
Reply With Quote
  #483  
Old 13.08.2019, 06:55
Hass Hass is offline
Junior Loader
 
Join Date: Aug 2019
Posts: 10
Default

@Jiar: I decided to give up on WD Clouds and build my own one for now. That said I can't update on how to get JD running w/o problems. Just in case other users have trouble too: It is possible to flash initrd to boot from hdd (partition label must be "rootfs") and also flash a newer kernel >v5. I won't go into more detail for now, since this isn't the topic of this thread.
Reply With Quote
  #484  
Old 13.08.2019, 09:34
Jiaz's Avatar
Jiaz Jiaz is offline
JD Manager
 
Join Date: Mar 2009
Location: Germany
Posts: 64,713
Default

@Hass: Thanks for the feedback. Build your own kernel or NAS ?
__________________
JD-Dev & Server-Admin
Reply With Quote
  #485  
Old 27.08.2019, 23:16
enricojacko enricojacko is offline
Modem User
 
Join Date: Aug 2019
Posts: 4
Default

Hi. I have the JD2 on QNAP NAS (Intel Celeron x64), I am using the MyJdownloader web interface.
Can someone help me to put the files inside the folder in the correct way? I am not totally confident on Linux commands, I just know how to login with PuTTy and that's it, but I can follow instructions. Thanks in advance.
Reply With Quote
  #486  
Old 28.08.2019, 10:45
looun looun is offline
Baby Loader
 
Join Date: Mar 2019
Posts: 6
Default

try with file manager MidnightCommander, qpkg you can download on qnapclub
**External links are only visible to Support Staff****External links are only visible to Support Staff**

Reply With Quote
  #487  
Old 28.08.2019, 14:08
Jiaz's Avatar
Jiaz Jiaz is offline
JD Manager
 
Join Date: Mar 2009
Location: Germany
Posts: 64,713
Default

@enricojacko: I can offer help via Teamviewer if you want. Just contact me via support@jdownloader.org
__________________
JD-Dev & Server-Admin
Reply With Quote
  #488  
Old 29.08.2019, 05:29
enricojacko enricojacko is offline
Modem User
 
Join Date: Aug 2019
Posts: 4
Default

Quote:
Originally Posted by Jiaz View Post
@enricojacko: I can offer help via Teamviewer if you want. Just contact me via support@jdownloader.org
Thanks a lot, I think I managed it to work. I copied both files inside the correct /libs folder using MidnightCommander and restarted JD2, it is extracting every archive.
Thanks again!
Reply With Quote
  #489  
Old 29.08.2019, 10:25
Jiaz's Avatar
Jiaz Jiaz is offline
JD Manager
 
Join Date: Mar 2009
Location: Germany
Posts: 64,713
Default

Thanks for the feedback! Glad to hear that you could solve this by yourself
__________________
JD-Dev & Server-Admin
Reply With Quote
  #490  
Old 30.08.2019, 09:31
wolverine wolverine is offline
Super Loader
 
Join Date: Jun 2010
Posts: 27
Default

Ist es geplant die Erweiterung auch für ältere Systeme mal bereitzustellen? Ist ja leider schon ein sehr altes Thema, aber Linux 32-Bit ist leider immer noch "comming soon..."
Reply With Quote
  #491  
Old 30.08.2019, 11:13
Jiaz's Avatar
Jiaz Jiaz is offline
JD Manager
 
Join Date: Mar 2009
Location: Germany
Posts: 64,713
Default

@wolverine: Ich selbst habe leider kein passendes System zum compilen, aber es ist nicht wirklich schwer sich die nötige Library selbst zu basteln, siehe
github.com/borisbrodski/sevenzipjbinding
Dort einfach der Anleitung folgen, sollte direkt 1:1 funktionieren. Bei Fragen/Probleme, einfach melden
__________________
JD-Dev & Server-Admin
Reply With Quote
  #492  
Old 30.08.2019, 12:10
wolverine wolverine is offline
Super Loader
 
Join Date: Jun 2010
Posts: 27
Default

Danke für die schnelle Antwort, ich werde dann mal mein Glück versuchen. Aber cmake werde ich dann wohl auch vorher noch selbst kompilieren müssen. Mal gucken ob das auf meinem alten QNAP NAS klappt... Ich werde berichten.
Reply With Quote
  #493  
Old 30.08.2019, 13:25
Jiaz's Avatar
Jiaz Jiaz is offline
JD Manager
 
Join Date: Mar 2009
Location: Germany
Posts: 64,713
Default

Quote:
Originally Posted by wolverine View Post
Danke für die schnelle Antwort, ich werde dann mal mein Glück versuchen. Aber cmake werde ich dann wohl auch vorher noch selbst kompilieren müssen. Mal gucken ob das auf meinem alten QNAP NAS klappt... Ich werde berichten.
Welche NAS genau ist es denn? Wundere mich das die noch 32bit sein soll?
__________________
JD-Dev & Server-Admin
Reply With Quote
  #494  
Old 30.08.2019, 15:17
wolverine wolverine is offline
Super Loader
 
Join Date: Jun 2010
Posts: 27
Default

Habe ein TS-439

cmake habe ich inzwischen drauf... war schon ein Kampf, da root (/) zu klein ist, aber die Bindings bekomme ich leider nicht compiliert. Muss man zwingend ein 1.5 er JDK nehmen? mit 1.8 geht es nicht.
Reply With Quote
  #495  
Old 30.08.2019, 15:28
Jiaz's Avatar
Jiaz Jiaz is offline
JD Manager
 
Join Date: Mar 2009
Location: Germany
Posts: 64,713
Default

Es geht auch mit Java1.8
Sicher wegen 32Bit? Laut Google ist das ne 64bit CPU und würde mich wundern wenn da dennoch 32Bit Kernel drauf wäre?!
__________________
JD-Dev & Server-Admin
Reply With Quote
  #496  
Old 30.08.2019, 15:44
wolverine wolverine is offline
Super Loader
 
Join Date: Jun 2010
Posts: 27
Default

# uname -a
Linux NAS 3.4.6 #1 SMP Tue Jul 30 10:57:46 CST 2019 i686 unknown

Und Screen JDownloader anbei.

# head /proc/cpuinfo
processor : 0
vendor_id : GenuineIntel
cpu family : 6
model : 28
model name : Genuine Intel(R) CPU N270 @ 1.60GHz
stepping : 2
microcode : 0x204
cpu MHz : 1600.063
cache size : 512 KB
physical id : 0

Laut Intel ist das Atom CPU mit 32-Bit
**External links are only visible to Support Staff****External links are only visible to Support Staff**
Attached Images
File Type: png 2019-08-30 15_32_38-My JDownloader.png (39.5 KB, 1 views)

Last edited by wolverine; 30.08.2019 at 15:49.
Reply With Quote
  #497  
Old 30.08.2019, 16:08
Jiaz's Avatar
Jiaz Jiaz is offline
JD Manager
 
Join Date: Mar 2009
Location: Germany
Posts: 64,713
Default

Ah, es gibt mehrere Modelle der Reihe TS-439, Entschuldige die Verwirrung.
__________________
JD-Dev & Server-Admin
Reply With Quote
  #498  
Old 30.08.2019, 16:25
wolverine wolverine is offline
Super Loader
 
Join Date: Jun 2010
Posts: 27
Default

Ja, leider.
das cmake ist noch ok, aber beim make ist dann leider Ende.
Fehler packe ich mal in den Spoiler, vielleicht kannst du damit was Anfagen?
Spoiler:
# make
Scanning dependencies of target sevenzip-jbinding-test-jar
[ 1%] test
warning: [options] bootstrap class path not set in conjunction with -source 1.5
warning: [options] source value 1.5 is obsolete and will be removed in a future release
warning: [options] target value 1.5 is obsolete and will be removed in a future release
warning: [options] To suppress warnings about obsolete options, use -Xlint:-options.
net/sf/sevenzipjbinding/junit/ExtractFileAbstractTest.java:13: error: cannot find symbol
import net.sf.sevenzipjbinding.ArchiveFormat;
^
symbol: class ArchiveFormat
location: package net.sf.sevenzipjbinding
net/sf/sevenzipjbinding/junit/ExtractFileAbstractTest.java:14: error: cannot find symbol
import net.sf.sevenzipjbinding.ExtractAskMode;
^
symbol: class ExtractAskMode
location: package net.sf.sevenzipjbinding
net/sf/sevenzipjbinding/junit/ExtractFileAbstractTest.java:15: error: cannot find symbol
import net.sf.sevenzipjbinding.ExtractOperationResult;
^
symbol: class ExtractOperationResult
location: package net.sf.sevenzipjbinding
net/sf/sevenzipjbinding/junit/ExtractFileAbstractTest.java:16: error: cannot find symbol
import net.sf.sevenzipjbinding.IArchiveExtractCallback;
^
symbol: class IArchiveExtractCallback
location: package net.sf.sevenzipjbinding
net/sf/sevenzipjbinding/junit/ExtractFileAbstractTest.java:17: error: cannot find symbol
import net.sf.sevenzipjbinding.IArchiveOpenCallback;
^
symbol: class IArchiveOpenCallback
location: package net.sf.sevenzipjbinding
net/sf/sevenzipjbinding/junit/ExtractFileAbstractTest.java:18: error: cannot find symbol
import net.sf.sevenzipjbinding.IArchiveOpenVolumeCallback;
^
symbol: class IArchiveOpenVolumeCallback
location: package net.sf.sevenzipjbinding
net/sf/sevenzipjbinding/junit/ExtractFileAbstractTest.java:19: error: cannot find symbol
import net.sf.sevenzipjbinding.ICryptoGetTextPassword;
^
symbol: class ICryptoGetTextPassword
location: package net.sf.sevenzipjbinding
net/sf/sevenzipjbinding/junit/ExtractFileAbstractTest.java:20: error: cannot find symbol
import net.sf.sevenzipjbinding.IInStream;
^
symbol: class IInStream
location: package net.sf.sevenzipjbinding
net/sf/sevenzipjbinding/junit/ExtractFileAbstractTest.java:21: error: cannot find symbol
import net.sf.sevenzipjbinding.ISequentialOutStream;
^
symbol: class ISequentialOutStream
location: package net.sf.sevenzipjbinding
net/sf/sevenzipjbinding/junit/ExtractFileAbstractTest.java:22: error: cannot find symbol
import net.sf.sevenzipjbinding.ISevenZipInArchive;
^
symbol: class ISevenZipInArchive
location: package net.sf.sevenzipjbinding
net/sf/sevenzipjbinding/junit/ExtractFileAbstractTest.java:23: error: cannot find symbol
import net.sf.sevenzipjbinding.PropID;
^
symbol: class PropID
location: package net.sf.sevenzipjbinding
net/sf/sevenzipjbinding/junit/ExtractFileAbstractTest.java:24: error: cannot find symbol
import net.sf.sevenzipjbinding.SevenZip;
^
symbol: class SevenZip
location: package net.sf.sevenzipjbinding
net/sf/sevenzipjbinding/junit/ExtractFileAbstractTest.java:25: error: cannot find symbol
import net.sf.sevenzipjbinding.SevenZipException;
^
symbol: class SevenZipException
location: package net.sf.sevenzipjbinding
net/sf/sevenzipjbinding/junit/ExtractFileAbstractTest.java:26: error: package net.sf.sevenzipjbinding.impl does not exist
import net.sf.sevenzipjbinding.impl.RandomAccessFileInStream;
^
net/sf/sevenzipjbinding/junit/ExtractFileAbstractTest.java:27: error: package net.sf.sevenzipjbinding.impl does not exist
import net.sf.sevenzipjbinding.impl.VolumedArchiveInStream;
^
net/sf/sevenzipjbinding/junit/JUnitNativeTestBase.java:4: error: cannot find symbol
import net.sf.sevenzipjbinding.SevenZip;
^
symbol: class SevenZip
location: package net.sf.sevenzipjbinding
net/sf/sevenzipjbinding/junit/JUnitNativeTestBase.java:5: error: cannot find symbol
import net.sf.sevenzipjbinding.SevenZipNativeInitializationException;
^
symbol: class SevenZipNativeInitializationException
location: package net.sf.sevenzipjbinding
net/sf/sevenzipjbinding/junit/ExtractFileAbstractTest.java:44: error: cannot find symbol
protected final ArchiveFormat archiveFormat;
^
symbol: class ArchiveFormat
location: class ExtractFileAbstractTest
net/sf/sevenzipjbinding/junit/ExtractFileAbstractTest.java:59: error: cannot find symbol
public ExtractFileAbstractTest(ArchiveFormat archiveFormat, String extention, int compression1, int compression2,
^
symbol: class ArchiveFormat
location: class ExtractFileAbstractTest
net/sf/sevenzipjbinding/junit/ExtractFileAbstractTest.java:68: error: cannot find symbol
public ExtractFileAbstractTest(ArchiveFormat archiveFormat, int compression1, int compression2, int compression3) {
^
symbol: class ArchiveFormat
location: class ExtractFileAbstractTest
net/sf/sevenzipjbinding/junit/JUnitNativeTestBase.java:31: error: cannot find symbol
public static void initializeSevenZipJBinding() throws SevenZipNativeInitializationException {
^
symbol: class SevenZipNativeInitializationException
location: class JUnitNativeTestBase
net/sf/sevenzipjbinding/junit/ExtractFileAbstractTest.java:401: error: cannot find symbol
private RandomAccessFileInStream randomAccessFileInStream;
^
symbol: class RandomAccessFileInStream
location: class ExtractFileAbstractTest.ExtractionInArchiveTestHelper
net/sf/sevenzipjbinding/junit/ExtractFileAbstractTest.java:616: error: cannot find symbol
public static class VolumeArchiveOpenCallback implements IArchiveOpenCallback, IArchiveOpenVolumeCallback,
^
symbol: class IArchiveOpenCallback
location: class ExtractFileAbstractTest
net/sf/sevenzipjbinding/junit/ExtractFileAbstractTest.java:616: error: cannot find symbol
public static class VolumeArchiveOpenCallback implements IArchiveOpenCallback, IArchiveOpenVolumeCallback,
^
symbol: class IArchiveOpenVolumeCallback
location: class ExtractFileAbstractTest
net/sf/sevenzipjbinding/junit/ExtractFileAbstractTest.java:617: error: cannot find symbol
ICryptoGetTextPassword {
^
symbol: class ICryptoGetTextPassword
location: class ExtractFileAbstractTest
net/sf/sevenzipjbinding/junit/ExtractFileAbstractTest.java:408: error: cannot find symbol
public ISevenZipInArchive openArchiveFileWithSevenZip(int fileIndex, int compressionIndex,
^
symbol: class ISevenZipInArchive
location: class ExtractFileAbstractTest.ExtractionInArchiveTestHelper
net/sf/sevenzipjbinding/junit/ExtractFileAbstractTest.java:409: error: cannot find symbol
boolean autodetectFormat, String testFileNameWE, String testFileExt) throws SevenZipException {
^
symbol: class SevenZipException
location: class ExtractFileAbstractTest.ExtractionInArchiveTestHelper
net/sf/sevenzipjbinding/junit/ExtractFileAbstractTest.java:630: error: cannot find symbol
public Object getProperty(PropID propID) {
^
symbol: class PropID
location: class VolumeArchiveOpenCallback
net/sf/sevenzipjbinding/junit/ExtractFileAbstractTest.java:642: error: cannot find symbol
public IInStream getStream(String filename) {
^
symbol: class IInStream
location: class VolumeArchiveOpenCallback
net/sf/sevenzipjbinding/junit/ExtractFileAbstractTest.java:681: error: cannot find symbol
public String cryptoGetTextPassword() throws SevenZipException {
^
symbol: class SevenZipException
location: class VolumeArchiveOpenCallback
net/sf/sevenzipjbinding/junit/ExtractFileAbstractTest.java:487: error: cannot find symbol
public class CombinedArchiveOpenCallback implements IArchiveOpenCallback, ICryptoGetTextPassword,
^
symbol: class IArchiveOpenCallback
location: class ExtractFileAbstractTest
net/sf/sevenzipjbinding/junit/ExtractFileAbstractTest.java:487: error: cannot find symbol
public class CombinedArchiveOpenCallback implements IArchiveOpenCallback, ICryptoGetTextPassword,
^
symbol: class ICryptoGetTextPassword
location: class ExtractFileAbstractTest
net/sf/sevenzipjbinding/junit/ExtractFileAbstractTest.java:488: error: cannot find symbol
IArchiveOpenVolumeCallback {
^
symbol: class IArchiveOpenVolumeCallback
location: class ExtractFileAbstractTest
net/sf/sevenzipjbinding/junit/ExtractFileAbstractTest.java:489: error: cannot find symbol
private final ICryptoGetTextPassword cryptoGetTextPassword;
^
symbol: class ICryptoGetTextPassword
location: class ExtractFileAbstractTest.CombinedArchiveOpenCallback
net/sf/sevenzipjbinding/junit/ExtractFileAbstractTest.java:490: error: cannot find symbol
private final IArchiveOpenVolumeCallback archiveOpenVolumeCallback;
^
symbol: class IArchiveOpenVolumeCallback
location: class ExtractFileAbstractTest.CombinedArchiveOpenCallback
net/sf/sevenzipjbinding/junit/ExtractFileAbstractTest.java:491: error: cannot find symbol
private final IArchiveOpenCallback archiveOpenCallback;
^
symbol: class IArchiveOpenCallback
location: class ExtractFileAbstractTest.CombinedArchiveOpenCallback
net/sf/sevenzipjbinding/junit/ExtractFileAbstractTest.java:493: error: cannot find symbol
public CombinedArchiveOpenCallback(IArchiveOpenCallback archiveOpenCallback,
^
symbol: class IArchiveOpenCallback
location: class ExtractFileAbstractTest.CombinedArchiveOpenCallback
net/sf/sevenzipjbinding/junit/ExtractFileAbstractTest.java:494: error: cannot find symbol
ICryptoGetTextPassword cryptoGetTextPassword, IArchiveOpenVolumeCallback archiveOpenVolumeCallback) {
^
symbol: class ICryptoGetTextPassword
location: class ExtractFileAbstractTest.CombinedArchiveOpenCallback
net/sf/sevenzipjbinding/junit/ExtractFileAbstractTest.java:494: error: cannot find symbol
ICryptoGetTextPassword cryptoGetTextPassword, IArchiveOpenVolumeCallback archiveOpenVolumeCallback) {
^
symbol: class IArchiveOpenVolumeCallback
location: class ExtractFileAbstractTest.CombinedArchiveOpenCallback
net/sf/sevenzipjbinding/junit/ExtractFileAbstractTest.java:501: error: cannot find symbol
public void setCompleted(Long files, Long bytes) throws SevenZipException {
^
symbol: class SevenZipException
location: class ExtractFileAbstractTest.CombinedArchiveOpenCallback
net/sf/sevenzipjbinding/junit/ExtractFileAbstractTest.java:505: error: cannot find symbol
public void setTotal(Long files, Long bytes) throws SevenZipException {
^
symbol: class SevenZipException
location: class ExtractFileAbstractTest.CombinedArchiveOpenCallback
net/sf/sevenzipjbinding/junit/ExtractFileAbstractTest.java:509: error: cannot find symbol
public String cryptoGetTextPassword() throws SevenZipException {
^
symbol: class SevenZipException
location: class ExtractFileAbstractTest.CombinedArchiveOpenCallback
net/sf/sevenzipjbinding/junit/ExtractFileAbstractTest.java:513: error: cannot find symbol
public Object getProperty(PropID propID) throws SevenZipException {
^
symbol: class PropID
location: class ExtractFileAbstractTest.CombinedArchiveOpenCallback
net/sf/sevenzipjbinding/junit/ExtractFileAbstractTest.java:513: error: cannot find symbol
public Object getProperty(PropID propID) throws SevenZipException {
^
symbol: class SevenZipException
location: class ExtractFileAbstractTest.CombinedArchiveOpenCallback
net/sf/sevenzipjbinding/junit/ExtractFileAbstractTest.java:517: error: cannot find symbol
public IInStream getStream(String filename) throws SevenZipException {
^
symbol: class IInStream
location: class ExtractFileAbstractTest.CombinedArchiveOpenCallback
net/sf/sevenzipjbinding/junit/ExtractFileAbstractTest.java:517: error: cannot find symbol
public IInStream getStream(String filename) throws SevenZipException {
^
symbol: class SevenZipException
location: class ExtractFileAbstractTest.CombinedArchiveOpenCallback
net/sf/sevenzipjbinding/junit/ExtractFileAbstractTest.java:523: error: cannot find symbol
public class PasswordArchiveOpenCallback implements IArchiveOpenCallback, ICryptoGetTextPassword {
^
symbol: class IArchiveOpenCallback
location: class ExtractFileAbstractTest
net/sf/sevenzipjbinding/junit/ExtractFileAbstractTest.java:523: error: cannot find symbol
public class PasswordArchiveOpenCallback implements IArchiveOpenCallback, ICryptoGetTextPassword {
^
symbol: class ICryptoGetTextPassword
location: class ExtractFileAbstractTest
net/sf/sevenzipjbinding/junit/ExtractFileAbstractTest.java:543: error: cannot find symbol
public String cryptoGetTextPassword() throws SevenZipException {
^
symbol: class SevenZipException
location: class ExtractFileAbstractTest.PasswordArchiveOpenCallback
net/sf/sevenzipjbinding/junit/ExtractFileAbstractTest.java:549: error: cannot find symbol
public class PasswordArchiveExtractCallback implements IArchiveExtractCallback, ICryptoGetTextPassword {
^
symbol: class IArchiveExtractCallback
location: class ExtractFileAbstractTest
net/sf/sevenzipjbinding/junit/ExtractFileAbstractTest.java:549: error: cannot find symbol
public class PasswordArchiveExtractCallback implements IArchiveExtractCallback, ICryptoGetTextPassword {
^
symbol: class ICryptoGetTextPassword
location: class ExtractFileAbstractTest
net/sf/sevenzipjbinding/junit/ExtractFileAbstractTest.java:551: error: cannot find symbol
private final ISequentialOutStream outputStream;
^
symbol: class ISequentialOutStream
location: class ExtractFileAbstractTest.PasswordArchiveExtractCallback
net/sf/sevenzipjbinding/junit/ExtractFileAbstractTest.java:552: error: cannot find symbol
private ExtractOperationResult extractOperationResult;
^
symbol: class ExtractOperationResult
location: class ExtractFileAbstractTest.PasswordArchiveExtractCallback
net/sf/sevenzipjbinding/junit/ExtractFileAbstractTest.java:554: error: cannot find symbol
public PasswordArchiveExtractCallback(ISequentialOutStream outputStream) {
^
symbol: class ISequentialOutStream
location: class ExtractFileAbstractTest.PasswordArchiveExtractCallback
net/sf/sevenzipjbinding/junit/ExtractFileAbstractTest.java:562: error: cannot find symbol
public ISequentialOutStream getStream(int index, ExtractAskMode extractAskMode) {
^
symbol: class ExtractAskMode
location: class ExtractFileAbstractTest.PasswordArchiveExtractCallback
net/sf/sevenzipjbinding/junit/ExtractFileAbstractTest.java:562: error: cannot find symbol
public ISequentialOutStream getStream(int index, ExtractAskMode extractAskMode) {
^
symbol: class ISequentialOutStream
location: class ExtractFileAbstractTest.PasswordArchiveExtractCallback
net/sf/sevenzipjbinding/junit/ExtractFileAbstractTest.java:570: error: cannot find symbol
public void prepareOperation(ExtractAskMode extractAskMode) {
^
symbol: class ExtractAskMode
location: class ExtractFileAbstractTest.PasswordArchiveExtractCallback
net/sf/sevenzipjbinding/junit/ExtractFileAbstractTest.java:577: error: cannot find symbol
public void setOperationResult(ExtractOperationResult extractOperationResult) {
^
symbol: class ExtractOperationResult
location: class ExtractFileAbstractTest.PasswordArchiveExtractCallback
net/sf/sevenzipjbinding/junit/ExtractFileAbstractTest.java:599: error: cannot find symbol
public String cryptoGetTextPassword() throws SevenZipException {
^
symbol: class SevenZipException
location: class ExtractFileAbstractTest.PasswordArchiveExtractCallback
net/sf/sevenzipjbinding/junit/ExtractFileAbstractTest.java:603: error: cannot find symbol
public ExtractOperationResult getExtractOperationResult() {
^
symbol: class ExtractOperationResult
location: class ExtractFileAbstractTest.PasswordArchiveExtractCallback
net/sf/sevenzipjbinding/junit/ExtractFileAbstractTest.java:608: error: cannot find symbol
public static class ExtractOperationResultException extends SevenZipException {
^
symbol: class SevenZipException
location: class ExtractFileAbstractTest
net/sf/sevenzipjbinding/junit/ExtractFileAbstractTest.java:611: error: cannot find symbol
public ExtractOperationResultException(ExtractOperationResult extractOperationResult) {
^
symbol: class ExtractOperationResult
location: class ExtractOperationResultException
net/sf/sevenzipjbinding/junit/JUnitInitializationTest.java:4: error: cannot find symbol
import net.sf.sevenzipjbinding.SevenZip;
^
symbol: class SevenZip
location: package net.sf.sevenzipjbinding
net/sf/sevenzipjbinding/junit/JUnitInitializationTest.java:5: error: cannot find symbol
import net.sf.sevenzipjbinding.SevenZipNativeInitializationException;
^
symbol: class SevenZipNativeInitializationException
location: package net.sf.sevenzipjbinding
net/sf/sevenzipjbinding/junit/JUnitInitializationTest.java:34: error: cannot find symbol
public void doubleInitializationTest() throws SevenZipNativeInitializationException {
^
symbol: class SevenZipNativeInitializationException
location: class JUnitInitializationTest
net/sf/sevenzipjbinding/junit/badarchive/GarbageArchiveFileTest.java:7: error: cannot find symbol
import net.sf.sevenzipjbinding.ArchiveFormat;
^
symbol: class ArchiveFormat
location: package net.sf.sevenzipjbinding
net/sf/sevenzipjbinding/junit/badarchive/GarbageArchiveFileTest.java:8: error: cannot find symbol
import net.sf.sevenzipjbinding.IInStream;
^
symbol: class IInStream
location: package net.sf.sevenzipjbinding
net/sf/sevenzipjbinding/junit/badarchive/GarbageArchiveFileTest.java:9: error: cannot find symbol
import net.sf.sevenzipjbinding.SevenZip;
^
symbol: class SevenZip
location: package net.sf.sevenzipjbinding
net/sf/sevenzipjbinding/junit/badarchive/GarbageArchiveFileTest.java:10: error: cannot find symbol
import net.sf.sevenzipjbinding.SevenZipException;
^
symbol: class SevenZipException
location: package net.sf.sevenzipjbinding
net/sf/sevenzipjbinding/junit/badarchive/GarbageArchiveFileTest.java:166: error: cannot find symbol
public void openBadArchive(ArchiveFormat archiveFormat) throws Throwable {
^
symbol: class ArchiveFormat
location: class GarbageArchiveFileTest
net/sf/sevenzipjbinding/junit/badarchive/GarbageArchiveFileTest.java:187: error: cannot find symbol
public void openBadArchiveMultithreaded(final ArchiveFormat archiveFormat) throws Throwable {
^
symbol: class ArchiveFormat
location: class GarbageArchiveFileTest
net/sf/sevenzipjbinding/junit/badarchive/GarbageArchiveFileTest.java:239: error: cannot find symbol
public void doOpenBadArchive(ArchiveFormat archiveFormat) throws Exception {
^
symbol: class ArchiveFormat
location: class GarbageArchiveFileTest
net/sf/sevenzipjbinding/junit/multiplefiles/ExtractMultipleFileAbstractHeaderPassTest.java:3: error: cannot find symbol
import net.sf.sevenzipjbinding.ArchiveFormat;
^
symbol: class ArchiveFormat
location: package net.sf.sevenzipjbinding
net/sf/sevenzipjbinding/junit/multiplefiles/ExtractMultipleFileAbstractHeaderPassTest.java:4: error: cannot find symbol
import net.sf.sevenzipjbinding.SevenZipException;
^
symbol: class SevenZipException
location: package net.sf.sevenzipjbinding
net/sf/sevenzipjbinding/junit/multiplefiles/ExtractMultipleFileAbstractPassTest.java:3: error: cannot find symbol
import net.sf.sevenzipjbinding.ArchiveFormat;
^
symbol: class ArchiveFormat
location: package net.sf.sevenzipjbinding
net/sf/sevenzipjbinding/junit/multiplefiles/ExtractMultipleFileAbstractTest.java:9: error: cannot find symbol
import net.sf.sevenzipjbinding.ArchiveFormat;
^
symbol: class ArchiveFormat
location: package net.sf.sevenzipjbinding
net/sf/sevenzipjbinding/junit/multiplefiles/ExtractMultipleFileAbstractTest.java:10: error: cannot find symbol
import net.sf.sevenzipjbinding.ISevenZipInArchive;
^
symbol: class ISevenZipInArchive
location: package net.sf.sevenzipjbinding
net/sf/sevenzipjbinding/junit/multiplefiles/ExtractMultipleFileAbstractHeaderPassTest.java:16: error: cannot find symbol
public ExtractMultipleFileAbstractHeaderPassTest(ArchiveFormat archiveFormat, int compression1, int compression2,
^
symbol: class ArchiveFormat
location: class ExtractMultipleFileAbstractHeaderPassTest
net/sf/sevenzipjbinding/junit/multiplefiles/ExtractMultipleFileAbstractHeaderPassTest.java:22: error: cannot find symbol
public ExtractMultipleFileAbstractHeaderPassTest(ArchiveFormat archiveFormat, String extention, int compression1,
^
symbol: class ArchiveFormat
location: class ExtractMultipleFileAbstractHeaderPassTest
net/sf/sevenzipjbinding/junit/multiplefiles/ExtractMultipleFileAbstractPassTest.java:9: error: cannot find symbol
public ExtractMultipleFileAbstractPassTest(ArchiveFormat archiveFormat, int compression1, int compression2,
^
symbol: class ArchiveFormat
location: class ExtractMultipleFileAbstractPassTest
net/sf/sevenzipjbinding/junit/multiplefiles/ExtractMultipleFileAbstractPassTest.java:20: error: cannot find symbol
public ExtractMultipleFileAbstractPassTest(ArchiveFormat archiveFormat, String extention, int compression1,
^
symbol: class ArchiveFormat
location: class ExtractMultipleFileAbstractPassTest
net/sf/sevenzipjbinding/junit/multiplefiles/ExtractMultipleFileAbstractTest.java:67: error: cannot find symbol
public ExtractMultipleFileAbstractTest(ArchiveFormat archiveFormat, int compression1, int compression2,
^
symbol: class ArchiveFormat
location: class ExtractMultipleFileAbstractTest
net/sf/sevenzipjbinding/junit/multiplefiles/ExtractMultipleFileAbstractTest.java:72: error: cannot find symbol
public ExtractMultipleFileAbstractTest(ArchiveFormat archiveFormat, String extention, int compression1,
^
symbol: class ArchiveFormat
location: class ExtractMultipleFileAbstractTest
net/sf/sevenzipjbinding/junit/multiplefiles/ExtractMultipleFileArjTest.java:3: error: cannot find symbol
import net.sf.sevenzipjbinding.ArchiveFormat;
^
symbol: class ArchiveFormat
location: package net.sf.sevenzipjbinding
net/sf/sevenzipjbinding/junit/multiplefiles/ExtractMultipleFileCabTest.java:3: error: cannot find symbol
import net.sf.sevenzipjbinding.ArchiveFormat;
^
symbol: class ArchiveFormat
location: package net.sf.sevenzipjbinding
net/sf/sevenzipjbinding/junit/multiplefiles/ExtractMultipleFileCpioTest.java:3: error: cannot find symbol
import net.sf.sevenzipjbinding.ArchiveFormat;
^
symbol: class ArchiveFormat
location: package net.sf.sevenzipjbinding
net/sf/sevenzipjbinding/junit/multiplefiles/ExtractMultipleFileIsoTest.java:3: error: cannot find symbol
import net.sf.sevenzipjbinding.ArchiveFormat;
^
symbol: class ArchiveFormat
location: package net.sf.sevenzipjbinding
net/sf/sevenzipjbinding/junit/multiplefiles/ExtractMultipleFileLzhTest.java:3: error: cannot find symbol
import net.sf.sevenzipjbinding.ArchiveFormat;
^
symbol: class ArchiveFormat
location: package net.sf.sevenzipjbinding
net/sf/sevenzipjbinding/junit/multiplefiles/ExtractMultipleFileRarHeaderPassTest.java:3: error: cannot find symbol
import net.sf.sevenzipjbinding.ArchiveFormat;
^
symbol: class ArchiveFormat
location: package net.sf.sevenzipjbinding
net/sf/sevenzipjbinding/junit/multiplefiles/ExtractMultipleFileRarPassTest.java:3: error: cannot find symbol
import net.sf.sevenzipjbinding.ArchiveFormat;
^
symbol: class ArchiveFormat
location: package net.sf.sevenzipjbinding
net/sf/sevenzipjbinding/junit/multiplefiles/ExtractMultipleFileRarTest.java:3: error: cannot find symbol
import net.sf.sevenzipjbinding.ArchiveFormat;
^
symbol: class ArchiveFormat
location: package net.sf.sevenzipjbinding
net/sf/sevenzipjbinding/junit/multiplefiles/ExtractMultipleFileRarVolumePassTest.java:3: error: cannot find symbol
import net.sf.sevenzipjbinding.ArchiveFormat;
^
symbol: class ArchiveFormat
location: package net.sf.sevenzipjbinding
net/sf/sevenzipjbinding/junit/multiplefiles/ExtractMultipleFileRarVolumeTest.java:3: error: cannot find symbol
import net.sf.sevenzipjbinding.ArchiveFormat;
^
symbol: class ArchiveFormat
location: package net.sf.sevenzipjbinding
net/sf/sevenzipjbinding/junit/multiplefiles/ExtractMultipleFileSevenZipHeaderPassTest.java:3: error: cannot find symbol
import net.sf.sevenzipjbinding.ArchiveFormat;
^
symbol: class ArchiveFormat
location: package net.sf.sevenzipjbinding
net/sf/sevenzipjbinding/junit/multiplefiles/ExtractMultipleFileSevenZipPassTest.java:3: error: cannot find symbol
import net.sf.sevenzipjbinding.ArchiveFormat;
^
symbol: class ArchiveFormat
location: package net.sf.sevenzipjbinding
net/sf/sevenzipjbinding/junit/multiplefiles/ExtractMultipleFileSevenZipTest.java:3: error: cannot find symbol
import net.sf.sevenzipjbinding.ArchiveFormat;
^
symbol: class ArchiveFormat
location: package net.sf.sevenzipjbinding
net/sf/sevenzipjbinding/junit/multiplefiles/ExtractMultipleFileSevenZipVolumeHeaderPassTest.java:3: error: cannot find symbol
import net.sf.sevenzipjbinding.ArchiveFormat;
^
symbol: class ArchiveFormat
location: package net.sf.sevenzipjbinding
net/sf/sevenzipjbinding/junit/multiplefiles/ExtractMultipleFileSevenZipVolumePassTest.java:3: error: cannot find symbol
import net.sf.sevenzipjbinding.ArchiveFormat;
^
symbol: class ArchiveFormat
location: package net.sf.sevenzipjbinding
net/sf/sevenzipjbinding/junit/multiplefiles/ExtractMultipleFileSevenZipVolumeTest.java:3: error: cannot find symbol
import net.sf.sevenzipjbinding.ArchiveFormat;
^
symbol: class ArchiveFormat
location: package net.sf.sevenzipjbinding
net/sf/sevenzipjbinding/junit/multiplefiles/ExtractMultipleFileTarTest.java:3: error: cannot find symbol
import net.sf.sevenzipjbinding.ArchiveFormat;
^
symbol: class ArchiveFormat
location: package net.sf.sevenzipjbinding
100 errors
4 warnings
make[2]: *** [CMakeFiles/sevenzip-jbinding-test-jar.dir/build.make:142: jbinding-java/sevenzip-jbinding-tests.jar] Error 1
make[1]: *** [CMakeFiles/Makefile2:110: CMakeFiles/sevenzip-jbinding-test-jar.dir/all] Error 2
make: *** [Makefile:163: all] Error 2
Reply With Quote
  #499  
Old 30.08.2019, 16:32
Jiaz's Avatar
Jiaz Jiaz is offline
JD Manager
 
Join Date: Mar 2009
Location: Germany
Posts: 64,713
Default

Hast du Zugriff auf ein Linux? Falls ja, könntest einfach zb eine VM mit 32bit Linux nutzen und dort drin compilen. Ich könnte das auch aber momentan fehlt mir dazu leider echt die Zeit :(
__________________
JD-Dev & Server-Admin
Reply With Quote
  #500  
Old 30.08.2019, 16:43
wolverine wolverine is offline
Super Loader
 
Join Date: Jun 2010
Posts: 27
Default

Ich mach mir mal eine in VirtualBox, mal gucken wie weit ich komme. Danke schon einmal. Ich werde berichten.
Reply With Quote
Reply

Thread Tools
Display Modes

Posting Rules
You may not post new threads
You may not post replies
You may not post attachments
You may not edit your posts

BB code is On
Smilies are On
[IMG] code is On
HTML code is Off

Forum Jump

All times are GMT +2. The time now is 22:08.
Provided By AppWork GmbH | Privacy | Imprint
Parts of the Design are used from Kirsch designed by Andrew & Austin
Powered by vBulletin® Version 3.8.10 Beta 1
Copyright ©2000 - 2019, Jelsoft Enterprises Ltd.